Target
Aromatase
Ligand
BDBM50047263
Substrate
Meas. Tech.
ChEBML_50687
IC50
233±n/a nM
Citation
 Furet, PBatzl, CBhatnagar, AFrancotte, ERihs, GLang, M Aromatase inhibitors: synthesis, biological activity, and binding mode of azole-type compounds. J Med Chem 36:1393-400 (1993)  
Target
Name:
Aromatase
Synonyms:
ARO1 CP19A_HUMAN CYP19 CYPXIX Cytochrome P450 19A1 Cytochrome P450-C19 (CYP19) FL cytokine receptor precursor | P-450AROM
Type:
Enzyme
Mol. Mass.:
57888.92
Organism:
Homo sapiens (Human)
Description:
P11511
Residue:
503
  
Inhibitor
Name:
BDBM50047263
Synonyms:
4-[5-(4-cyanophenyl)-5,6,7,8-tetrahydroimidazo[1,5-a]pyridin-5-yl]benzonitrile | CHEMBL285809
Type:
Small organic molecule
Emp. Form.:
C21H16N4
Mol. Mass.:
324.3785
SMILES:
N#Cc1ccc(cc1)C1(CCCc2cncn12)c1ccc(cc1)C#N
: