Target
5-hydroxytryptamine receptor 1A
Ligand
BDBM50456023
Substrate
Meas. Tech.
ChEBML_860
IC50
437±n/a nM
Citation
 Cliffe, IABrightwell, CIFletcher, AForster, EAMansell, HLReilly, YRoutledge, CWhite, AC (S)-N-tert-butyl-3-(4-(2-methoxyphenyl)-piperazin-1-yl)-2-phenylpropanamide [(S)-WAY-100135]: a selective antagonist at presynaptic and postsynaptic 5-HT1A receptors. J Med Chem 36:1509-10 (1993)  
Target
Name:
5-hydroxytryptamine receptor 1A
Synonyms:
5-HT-1A 5-HT1A 5-hydroxytryptamine receptor 1A (5HT1A) 5ht1a Htr1a Serotonin 1a (5-HT1a) receptor/Adrenergic receptor alpha-1 | Serotonin receptor 1A
Type:
G Protein-Coupled Receptor (GPCR)
Mol. Mass.:
46445.29
Organism:
Rattus norvegicus (rat)
Description:
Binding assays were performed using rat hippocampal membranes.
Residue:
422
  
Inhibitor
Name:
BDBM50456023
Synonyms:
CHEMBL289981
Type:
Small organic molecule
Emp. Form.:
C24H33N3O2
Mol. Mass.:
395.5377
SMILES:
COc1ccccc1N1CCN(C[C@H](C(=O)NC(C)(C)C)c2ccccc2)CC1
: