Target
Acyl-CoA:cholesterol acyltransferase
Ligand
BDBM50047582
Substrate
Meas. Tech.
ChEMBL_28334 (CHEMBL645898)
IC50
150±n/a nM
Citation
 Kimura, TWatanabe, NMatsui, MHayashi, KTanaka, HOhtsuka, ISaeki, TKogushi, MKabayashi, HAkasaka, K Structure-activity relationship of a series of phenylureas linked to 4-phenylimidazole. Novel potent inhibitors of acyl-CoA:cholesterol O-acyltransferase with antiatherosclerotic activity. 2. J Med Chem 36:1641-53 (1993)  
Target
Name:
Acyl-CoA:cholesterol acyltransferase
Synonyms:
ACAT
Type:
Mol. Mass.:
35405.31
Organism:
Oryctolagus cuniculus
Description:
Residue:
305
  
Inhibitor
Name:
BDBM50047582
Synonyms:
3-{3-[3-Methyl-2-(3-pentyl-ureido)-phenoxy]-propyl}-5-phenyl-3H-imidazole-4-carboxylic acid ethyl ester | CHEMBL42760
Type:
Small organic molecule
Emp. Form.:
C28H36N4O4
Mol. Mass.:
492.6098
SMILES:
CCCCCNC(=O)Nc1c(C)cccc1OCCCn1cnc(c1C(=O)OCC)-c1ccccc1
: