Target
Acyl-CoA:cholesterol acyltransferase
Ligand
BDBM50047590
Substrate
Meas. Tech.
ChEMBL_28331 (CHEMBL645895)
IC50
220±n/a nM
Citation
 Kimura, TWatanabe, NMatsui, MHayashi, KTanaka, HOhtsuka, ISaeki, TKogushi, MKabayashi, HAkasaka, K Structure-activity relationship of a series of phenylureas linked to 4-phenylimidazole. Novel potent inhibitors of acyl-CoA:cholesterol O-acyltransferase with antiatherosclerotic activity. 2. J Med Chem 36:1641-53 (1993)  
Target
Name:
Acyl-CoA:cholesterol acyltransferase
Synonyms:
ACAT
Type:
Mol. Mass.:
35405.31
Organism:
Oryctolagus cuniculus
Description:
Residue:
305
  
Inhibitor
Name:
BDBM50047590
Synonyms:
1-{2-[3-(4,5-Dihydro-naphtho[1,2-d]imidazol-3-yl)-propoxy]-6-methyl-phenyl}-3-pentyl-urea | CHEMBL47093
Type:
Small organic molecule
Emp. Form.:
C27H34N4O2
Mol. Mass.:
446.5845
SMILES:
CCCCCNC(=O)Nc1c(C)cccc1OCCCn1cnc-2c1CCc1ccccc-21
: