Target
Carbonic anhydrase 1
Ligand
BDBM26988
Substrate
Meas. Tech.
ChEMBL_1538230 (CHEMBL3737169)
Ki
7000000±n/a nM
Citation
 Cincinelli, AMartellini, TVullo, DSupuran, CT Anion and sulfonamide inhibition studies of an ?-carbonic anhydrase from the Antarctic hemoglobinless fish Chionodraco hamatus. Bioorg Med Chem Lett 25:5485-9 (2015)  
Target
Name:
Carbonic anhydrase 1
Synonyms:
CA-I CAB Carbonate dehydratase I Carbonic anhydrase 1 (CA I) Carbonic anhydrase 1 (Recombinant CA I) Carbonic anhydrase B Carbonic anhydrase I (CA I) Carbonic anhydrase I (CAI) Carbonic anhydrase isoenzyme I (hCA I) | hCA
Type:
Enzyme
Mol. Mass.:
28873.37
Organism:
Homo sapiens (Human)
Description:
P00915
Residue:
261
  
Inhibitor
Name:
BDBM26988
Synonyms:
CHEMBL1644029 CHEMBL186200 nitrate ion | nitrooxidane
Type:
Ion
Emp. Form.:
NO3
Mol. Mass.:
62.0054
SMILES:
[O-][N+]([O-])=O
: