Target
Synaptic vesicular amine transporter
Ligand
BDBM50048895
Substrate
Meas. Tech.
ChEMBL_213572 (CHEMBL816127)
Ki
33±n/a nM
Citation
 Lee, LCVander Borght, TSherman, PSFrey, KAKilbourn, MR In vitro and in vivo studies of benzisoquinoline ligands for the brain synaptic vesicle monoamine transporter. J Med Chem 39:191-6 (1996)  
Target
Name:
Synaptic vesicular amine transporter
Synonyms:
Monoamine transporter Solute carrier family 18 member 2 Synaptic vesicular amine transporter VMAT2_RAT Vesicular monoamine transporter 2 (VMAT2) | Vmat2
Type:
Protein
Mol. Mass.:
55689.58
Organism:
Rattus norvegicus (Rat)
Description:
Q01827
Residue:
515
  
Inhibitor
Name:
BDBM50048895
Synonyms:
(2S,3R,11bR)-2,3-Diisobutyl-9,10-dimethoxy-1,3,4,6,7,11b-hexahydro-2H-pyrido[2,1-a]isoquinolin-2-ol | CHEMBL61363
Type:
Small organic molecule
Emp. Form.:
C23H37NO3
Mol. Mass.:
375.5448
SMILES:
COc1cc2CCN3C[C@@H](CC(C)C)[C@](O)(CC(C)C)C[C@@H]3c2cc1OC
: