Target
Adenosine receptor A1
Ligand
BDBM50014323
Substrate
Meas. Tech.
ChEMBL_29486 (CHEMBL641720)
Ki
786.0±n/a nM
Citation
 Ji, XDMelman, NJacobson, KA Interactions of flavonoids and other phytochemicals with adenosine receptors. J Med Chem 39:781-8 (1996)  
Target
Name:
Adenosine receptor A1
Synonyms:
AA1R_RAT ADENOSINE A1 high Adenosine A1 receptor (A1) Adenosine receptors A1 | Adora1
Type:
Protein
Mol. Mass.:
36704.13
Organism:
Rattus norvegicus (rat)
Description:
Residue:
326
  
Inhibitor
Name:
BDBM50014323
Synonyms:
2-PHENYL-4H-BENZO[H]CHROMEN-4-ONE 7,8-Benzoflavone alpha-naphthoflavone
Type:
Small organic molecule
Emp. Form.:
C19H12O2
Mol. Mass.:
272.2974
SMILES:
O=c1cc(oc2c3ccccc3ccc12)-c1ccccc1
: