Target
Prostaglandin G/H synthase 1
Ligand
BDBM50049637
Substrate
Meas. Tech.
ChEMBL_158742 (CHEMBL768749)
IC50
>100000±n/a nM
Citation
 Li, JJNorton, MBReinhard, EJAnderson, GDGregory, SAIsakson, PCKoboldt, CMMasferrer, JLPerkins, WESeibert, KZhang, YZweifel, BSReitz, DB Novel terphenyls as selective cyclooxygenase-2 inhibitors and orally active anti-inflammatory agents. J Med Chem 39:1846-56 (1996)  
Target
Name:
Prostaglandin G/H synthase 1
Synonyms:
COX-1 Cyclooxygenase Cyclooxygenase-1 (COX-1) PTGS1 | Prostaglandin G/H synthase (cyclooxygenase)
Type:
Enzyme
Mol. Mass.:
68692.62
Organism:
Homo sapiens (Human)
Description:
P23219
Residue:
599
  
Inhibitor
Name:
BDBM50049637
Synonyms:
3-Chloro-4',5'-difluoro-4''-methanesulfonyl-4-methyl-[1,1';2',1'']terphenyl | CHEMBL417748
Type:
Small organic molecule
Emp. Form.:
C20H15ClF2O2S
Mol. Mass.:
392.847
SMILES:
Cc1ccc(cc1Cl)-c1cc(F)c(F)cc1-c1ccc(cc1)S(C)(=O)=O
: