Target
Prostaglandin G/H synthase 2
Ligand
BDBM50049661
Substrate
Meas. Tech.
ChEMBL_159753 (CHEMBL762917)
IC50
33±n/a nM
Citation
 Li, JJNorton, MBReinhard, EJAnderson, GDGregory, SAIsakson, PCKoboldt, CMMasferrer, JLPerkins, WESeibert, KZhang, YZweifel, BSReitz, DB Novel terphenyls as selective cyclooxygenase-2 inhibitors and orally active anti-inflammatory agents. J Med Chem 39:1846-56 (1996)  
Target
Name:
Prostaglandin G/H synthase 2
Synonyms:
COX2 Cyclooxygenase 2 (COX-2) Cyclooxygenase-2 (COX-2 AA) Cyclooxygenase-2 (COX-2) PGH2_HUMAN PHS II Prostaglandin E synthase/G/H synthase 2 Prostaglandin-endoperoxide synthase 2
Type:
Enzyme
Mol. Mass.:
69003.89
Organism:
Homo sapiens (Human)
Description:
Recombinant Cox-2 provided by Cayman (Cayman Chemical Co.,Ann Arbor, MI).
Residue:
604
  
Inhibitor
Name:
BDBM50049661
Synonyms:
3''''-Fluoro-4''''-methoxy-[1,1'';2'',1'''']terphenyl-4-sulfonic acid amide CHEMBL442166
Type:
Small organic molecule
Emp. Form.:
C19H16FNO3S
Mol. Mass.:
357.399
SMILES:
COc1ccc(cc1F)-c1ccccc1-c1ccc(cc1)S(N)(=O)=O
: