Target
Dihydrofolate reductase
Ligand
BDBM50050413
Substrate
Meas. Tech.
ChEMBL_52980 (CHEMBL664188)
IC50
7000±n/a nM
Citation
 Piper, JRJohnson, CAKrauth, CACarter, RLHosmer, CAQueener, SFBorotz, SEPfefferkorn, ER Lipophilic antifolates as agents against opportunistic infections. 1. Agents superior to trimetrexate and piritrexim against Toxoplasma gondii and Pneumocystis carinii in in vitro evaluations. J Med Chem 39:1271-80 (1996)  
Target
Name:
Dihydrofolate reductase
Synonyms:
DYR_PNECA Dihydrofolate reductase Tetrahydrofolate dehydrogenase
Type:
Enzyme
Mol. Mass.:
23891.29
Organism:
Pneumocystis carinii
Description:
Residue:
206
  
Inhibitor
Name:
BDBM50050413
Synonyms:
6-[(3,4,5-Trimethoxy-phenylamino)-methyl]-pteridine-2,4-diamine | CHEMBL23459
Type:
Small organic molecule
Emp. Form.:
C16H19N7O3
Mol. Mass.:
357.3672
SMILES:
COc1cc(NCc2cnc3nc(N)nc(N)c3n2)cc(OC)c1OC
: