Target
Bifunctional dihydrofolate reductase-thymidylate synthase
Ligand
BDBM50050398
Substrate
Meas. Tech.
ChEMBL_53465 (CHEMBL665590)
IC50
10600±n/a nM
Citation
 Piper, JRJohnson, CAKrauth, CACarter, RLHosmer, CAQueener, SFBorotz, SEPfefferkorn, ER Lipophilic antifolates as agents against opportunistic infections. 1. Agents superior to trimetrexate and piritrexim against Toxoplasma gondii and Pneumocystis carinii in in vitro evaluations. J Med Chem 39:1271-80 (1996)  
Target
Name:
Bifunctional dihydrofolate reductase-thymidylate synthase
Synonyms:
DHFR-TS Dihydrofolate reductase Dihydrofolate reductase; T. gondii vs rat
Type:
Enzyme
Mol. Mass.:
68757.49
Organism:
Toxoplasma gondii
Description:
Q07422
Residue:
610
  
Inhibitor
Name:
BDBM50050398
Synonyms:
6-[(2-Methoxy-5-trifluoromethyl-phenylamino)-methyl]-pteridine-2,4-diamine | CHEMBL23495
Type:
Small organic molecule
Emp. Form.:
C15H14F3N7O
Mol. Mass.:
365.3132
SMILES:
COc1ccc(cc1NCc1cnc2nc(N)nc(N)c2n1)C(F)(F)F
: