Target
Dihydrofolate reductase
Ligand
BDBM50050402
Substrate
Meas. Tech.
ChEMBL_52980 (CHEMBL664188)
IC50
42200±n/a nM
Citation
 Piper, JRJohnson, CAKrauth, CACarter, RLHosmer, CAQueener, SFBorotz, SEPfefferkorn, ER Lipophilic antifolates as agents against opportunistic infections. 1. Agents superior to trimetrexate and piritrexim against Toxoplasma gondii and Pneumocystis carinii in in vitro evaluations. J Med Chem 39:1271-80 (1996)  
Target
Name:
Dihydrofolate reductase
Synonyms:
DYR_PNECA Dihydrofolate reductase Tetrahydrofolate dehydrogenase
Type:
Enzyme
Mol. Mass.:
23891.29
Organism:
Pneumocystis carinii
Description:
Residue:
206
  
Inhibitor
Name:
BDBM50050402
Synonyms:
6-(3-Chloro-phenylsulfanylmethyl)-pteridine-2,4-diamine | CHEMBL409194
Type:
Small organic molecule
Emp. Form.:
C13H11ClN6S
Mol. Mass.:
318.785
SMILES:
Nc1nc(N)c2nc(CSc3cccc(Cl)c3)cnc2n1
: