Target
Bifunctional dihydrofolate reductase-thymidylate synthase
Ligand
BDBM50050414
Substrate
Meas. Tech.
ChEMBL_53465 (CHEMBL665590)
IC50
140±n/a nM
Citation
 Piper, JRJohnson, CAKrauth, CACarter, RLHosmer, CAQueener, SFBorotz, SEPfefferkorn, ER Lipophilic antifolates as agents against opportunistic infections. 1. Agents superior to trimetrexate and piritrexim against Toxoplasma gondii and Pneumocystis carinii in in vitro evaluations. J Med Chem 39:1271-80 (1996)  
Target
Name:
Bifunctional dihydrofolate reductase-thymidylate synthase
Synonyms:
DHFR-TS Dihydrofolate reductase Dihydrofolate reductase; T. gondii vs rat
Type:
Enzyme
Mol. Mass.:
68757.49
Organism:
Toxoplasma gondii
Description:
Q07422
Residue:
610
  
Inhibitor
Name:
BDBM50050414
Synonyms:
6-((2,5-dimethoxyphenylamino)methyl)quinazoline-2,4-diamine CHEMBL23454
Type:
Small organic molecule
Emp. Form.:
C17H19N5O2
Mol. Mass.:
325.3651
SMILES:
COc1ccc(OC)c(NCc2ccc3nc(N)nc(N)c3c2)c1
: