Target
Dihydrofolate reductase
Ligand
BDBM50050421
Substrate
Meas. Tech.
ChEMBL_55115 (CHEMBL665442)
IC50
23±n/a nM
Citation
 Piper, JRJohnson, CAKrauth, CACarter, RLHosmer, CAQueener, SFBorotz, SEPfefferkorn, ER Lipophilic antifolates as agents against opportunistic infections. 1. Agents superior to trimetrexate and piritrexim against Toxoplasma gondii and Pneumocystis carinii in in vitro evaluations. J Med Chem 39:1271-80 (1996)  
Target
Name:
Dihydrofolate reductase
Synonyms:
DYR_RAT Dihydrofolate reductase (DHFR) Tetrahydrofolate dehydrogenase
Type:
Enzyme
Mol. Mass.:
21638.84
Organism:
Rattus norvegicus (rat)
Description:
Residue:
187
  
Inhibitor
Name:
BDBM50050421
Synonyms:
6-[(4-Chloro-2-methyl-phenylamino)-methyl]-quinazoline-2,4-diamine | CHEMBL23227
Type:
Small organic molecule
Emp. Form.:
C16H16ClN5
Mol. Mass.:
313.785
SMILES:
Cc1cc(Cl)ccc1NCc1ccc2nc(N)nc(N)c2c1
: