Target
Dihydrofolate reductase
Ligand
BDBM50050383
Substrate
Meas. Tech.
ChEMBL_55115 (CHEMBL665442)
IC50
720±n/a nM
Citation
 Piper, JRJohnson, CAKrauth, CACarter, RLHosmer, CAQueener, SFBorotz, SEPfefferkorn, ER Lipophilic antifolates as agents against opportunistic infections. 1. Agents superior to trimetrexate and piritrexim against Toxoplasma gondii and Pneumocystis carinii in in vitro evaluations. J Med Chem 39:1271-80 (1996)  
Target
Name:
Dihydrofolate reductase
Synonyms:
DYR_RAT Dihydrofolate reductase (DHFR) Tetrahydrofolate dehydrogenase
Type:
Enzyme
Mol. Mass.:
21638.84
Organism:
Rattus norvegicus (rat)
Description:
Residue:
187
  
Inhibitor
Name:
BDBM50050383
Synonyms:
6-[(4-Chloro-phenylamino)-methyl]-pyrido[2,3-d]pyrimidine-2,4-diamine | CHEMBL23492
Type:
Small organic molecule
Emp. Form.:
C14H13ClN6
Mol. Mass.:
300.746
SMILES:
Nc1nc(N)c2cc(CNc3ccc(Cl)cc3)cnc2n1
: