Target
Dihydrofolate reductase
Ligand
BDBM50050428
Substrate
Meas. Tech.
ChEMBL_55115 (CHEMBL665442)
IC50
300±n/a nM
Citation
 Piper, JRJohnson, CAKrauth, CACarter, RLHosmer, CAQueener, SFBorotz, SEPfefferkorn, ER Lipophilic antifolates as agents against opportunistic infections. 1. Agents superior to trimetrexate and piritrexim against Toxoplasma gondii and Pneumocystis carinii in in vitro evaluations. J Med Chem 39:1271-80 (1996)  
Target
Name:
Dihydrofolate reductase
Synonyms:
DYR_RAT Dihydrofolate reductase (DHFR) Tetrahydrofolate dehydrogenase
Type:
Enzyme
Mol. Mass.:
21638.84
Organism:
Rattus norvegicus (rat)
Description:
Residue:
187
  
Inhibitor
Name:
BDBM50050428
Synonyms:
6-[(4-Chloro-phenylamino)-methyl]-pteridine-2,4-diamine | CHEMBL22672
Type:
Small organic molecule
Emp. Form.:
C13H12ClN7
Mol. Mass.:
301.734
SMILES:
Nc1nc(N)c2nc(CNc3ccc(Cl)cc3)cnc2n1
: