Target
Sterol O-acyltransferase 1
Ligand
BDBM50050737
Substrate
Meas. Tech.
ChEMBL_28794 (CHEMBL641704)
IC50
1400±n/a nM
Citation
 Vaccaro, WAmore, CBerger, JBurrier, RClader, JDavis, HDomalski, MFevig, TSalisbury, BSher, R Inhibitors of acyl CoA:cholesterol acyltransferase. J Med Chem 39:1704-19 (1996)  
Target
Name:
Sterol O-acyltransferase 1
Synonyms:
ACAT-1 Acat SOAT1_RAT Sterol O-acyltransferase, Soat
Type:
PROTEIN
Mol. Mass.:
64165.56
Organism:
Rattus norvegicus
Description:
ChEMBL_28796
Residue:
545
  
Inhibitor
Name:
BDBM50050737
Synonyms:
CHEMBL412439 | N-((1S,2R)-5-Hydroxy-2-phenyl-1,2,3,4-tetrahydro-naphthalen-1-yl)-2,2-diphenyl-acetamide
Type:
Small organic molecule
Emp. Form.:
C30H27NO2
Mol. Mass.:
433.5409
SMILES:
Oc1cccc2[C@@H](NC(=O)C(c3ccccc3)c3ccccc3)[C@H](CCc12)c1ccccc1
: