Target
Sterol O-acyltransferase 1
Ligand
BDBM50050744
Substrate
Meas. Tech.
ChEMBL_28795 (CHEMBL641705)
IC50
100±n/a nM
Citation
 Vaccaro, WAmore, CBerger, JBurrier, RClader, JDavis, HDomalski, MFevig, TSalisbury, BSher, R Inhibitors of acyl CoA:cholesterol acyltransferase. J Med Chem 39:1704-19 (1996)  
Target
Name:
Sterol O-acyltransferase 1
Synonyms:
ACAT-1 Acat SOAT1_RAT Sterol O-acyltransferase, Soat
Type:
PROTEIN
Mol. Mass.:
64165.56
Organism:
Rattus norvegicus
Description:
ChEMBL_28796
Residue:
545
  
Inhibitor
Name:
BDBM50050744
Synonyms:
CHEMBL367428 | N-[2-(4-Hydroxy-phenyl)-indan-1-yl]-2,2-diphenyl-acetamide
Type:
Small organic molecule
Emp. Form.:
C29H25NO2
Mol. Mass.:
419.5143
SMILES:
Oc1ccc(cc1)C1Cc2ccccc2C1NC(=O)C(c1ccccc1)c1ccccc1
: