Target
Sterol O-acyltransferase 1
Ligand
BDBM50034740
Substrate
Meas. Tech.
ChEMBL_28794 (CHEMBL641704)
IC50
1600±n/a nM
Citation
 Vaccaro, WAmore, CBerger, JBurrier, RClader, JDavis, HDomalski, MFevig, TSalisbury, BSher, R Inhibitors of acyl CoA:cholesterol acyltransferase. J Med Chem 39:1704-19 (1996)  
Target
Name:
Sterol O-acyltransferase 1
Synonyms:
ACAT-1 Acat SOAT1_RAT Sterol O-acyltransferase, Soat
Type:
PROTEIN
Mol. Mass.:
64165.56
Organism:
Rattus norvegicus
Description:
ChEMBL_28796
Residue:
545
  
Inhibitor
Name:
BDBM50034740
Synonyms:
CHEMBL41351 | N-[2-(4-Methoxy-phenyl)-1-phenyl-ethyl]-2,2-diphenyl-acetamide
Type:
Small organic molecule
Emp. Form.:
C29H27NO2
Mol. Mass.:
421.5302
SMILES:
COc1ccc(CC(NC(=O)C(c2ccccc2)c2ccccc2)c2ccccc2)cc1
: