Target
Integrin alpha-IIb/beta-3
Ligand
BDBM50050776
Substrate
Meas. Tech.
ChEMBL_30114 (CHEMBL642041)
Ki
9±n/a nM
Citation
 Stilz, HUJablonka, BJust, MKnolle, JPaulus, EFZoller, G Discovery of an orally active non-peptide fibrinogen receptor antagonist. J Med Chem 39:2118-22 (1996)  
Target
Name:
Integrin alpha-IIb/beta-3
Synonyms:
Glycoprotein IIb/IIIa
Type:
Mol. Mass.:
Description:
ASSAY_ID of EBI is 30109
Components:
This complex has 2 components.
Component 1
Name:
Integrin beta-3
Synonyms:
CD_antigen=CD61 GPIIIa ITGB3 Platelet membrane glycoprotein IIIa
Type:
Protein
Mol. Mass.:
87038.91
Organism:
Homo sapiens (Human)
Description:
P05106
Residue:
788
  
Component 2
Name:
Integrin alpha-IIb
Synonyms:
CD_antigen=CD41 GPIIb Glycoprotein IIb ITGA2B Integrin alpha-IIb heavy chain Integrin alpha-IIb light chain, form 2 Integrin alpha-V/beta-3 and alpha-IIb/beta 3 | Platelet membrane glycoprotein IIb
Type:
Protein
Mol. Mass.:
113354.85
Organism:
Homo sapiens (Human)
Description:
P08514
Residue:
1039
  
Inhibitor
Name:
BDBM50050776
Synonyms:
(S)-3-{2-[(S)-4-(4-Carbamimidoyl-phenyl)-4-methyl-2,5-dioxo-imidazolidin-1-yl]-acetylamino}-3-phenyl-propionic acid CHEMBL17258
Type:
Small organic molecule
Emp. Form.:
C22H23N5O5
Mol. Mass.:
437.4485
SMILES:
C[C@]1(NC(=O)N(CC(=O)N[C@@H](CC(O)=O)c2ccccc2)C1=O)c1ccc(cc1)C(N)=N
: