Target
Adenosine receptor A3
Ligand
BDBM50051350
Substrate
Meas. Tech.
ChEMBL_31838 (CHEMBL641515)
Ki
42800±n/a nM
Citation
 Karton, YJiang, JLJi, XDMelman, NOlah, MEStiles, GLJacobson, KA Synthesis and biological activities of flavonoid derivatives as A3 adenosine receptor antagonists. J Med Chem 39:2293-301 (1996)  
Target
Name:
Adenosine receptor A3
Synonyms:
A3 adenosine receptor (hA3) ADORA3 | Adenosine A3 receptor (A3AR)
Type:
G Protein-Coupled Receptor (GPCR)
Mol. Mass.:
36197.32
Organism:
Homo sapiens (Human)
Description:
P0DMS8
Residue:
318
  
Inhibitor
Name:
BDBM50051350
Synonyms:
2,3-Dihydro-2-(4-hydroxyphenyl)-4H-1-benzopyran-4-one 4'-Hydroxyflavanone | CHEMBL73933
Type:
Small organic molecule
Emp. Form.:
C15H12O3
Mol. Mass.:
240.254
SMILES:
Oc1ccc(cc1)C1CC(=O)c2ccccc2O1
: