Target
Adenosine receptor A2a
Ligand
BDBM50051662
Substrate
Meas. Tech.
ChEMBL_31067 (CHEMBL640427)
Ki
88400.0±n/a nM
Citation
 Müller, CEGeis, UGrahner, BLanzner, WEger, K Chiral pyrrolo[2,3-d]pyrimidine and pyrimido[4,5-b]indole derivatives: structure-activity relationships of potent, highly stereoselective A1-adenosine receptor antagonists. J Med Chem 39:2482-91 (1996)  
Target
Name:
Adenosine receptor A2a
Synonyms:
AA2AR_RAT Adenosine A2 receptor Adenosine Receptors A2a (A2a) Adenosine receptors A2a Rat striatal adenosine A2a receptor
Type:
G Protein-Coupled Receptor (GPCR)
Mol. Mass.:
45015.65
Organism:
Rattus norvegicus (rat)
Description:
Rat A2A receptors expressed in CHO cells.
Residue:
410
  
Inhibitor
Name:
BDBM50051662
Synonyms:
7'-(1-phenylethyl)spiro[cyclopentane-1,5'-(4',5',6',7'-tetrahydro-3'H-pyrrolo[2,3-d]pyrimidine)]-4',6'-dione | CHEMBL314104
Type:
Small organic molecule
Emp. Form.:
C18H19N3O2
Mol. Mass.:
309.3624
SMILES:
CC(N1C(=O)C2(CCCC2)c2c1nc[nH]c2=O)c1ccccc1
: