Target
Adenosine receptor A1
Ligand
BDBM50051676
Substrate
Meas. Tech.
ChEMBL_29636 (CHEMBL639743)
Ki
273±n/a nM
Citation
 Müller, CEGeis, UGrahner, BLanzner, WEger, K Chiral pyrrolo[2,3-d]pyrimidine and pyrimido[4,5-b]indole derivatives: structure-activity relationships of potent, highly stereoselective A1-adenosine receptor antagonists. J Med Chem 39:2482-91 (1996)  
Target
Name:
Adenosine receptor A1
Synonyms:
AA1R_RAT ADENOSINE A1 high Adenosine A1 receptor (A1) Adenosine receptors A1 | Adora1
Type:
Protein
Mol. Mass.:
36704.13
Organism:
Rattus norvegicus (rat)
Description:
Residue:
326
  
Inhibitor
Name:
BDBM50051676
Synonyms:
2-(2-Chloro-phenyl)-5,6-dimethyl-7-((S)-1-phenyl-ethyl)-7H-pyrrolo[2,3-d]pyrimidin-4-ylamine | CHEMBL316202
Type:
Small organic molecule
Emp. Form.:
C22H21ClN4
Mol. Mass.:
376.882
SMILES:
C[C@@H](c1ccccc1)n1c(C)c(C)c2c(N)nc(nc12)-c1ccccc1Cl
: