Target
Xanthine dehydrogenase/oxidase
Ligand
BDBM50051737
Substrate
Meas. Tech.
ChEMBL_217078 (CHEMBL823474)
IC50
115±n/a nM
Citation
 Biagi, GCostantini, ACostantino, LGiorgi, ILivi, OPecorari, PRinaldi, MScartoni, V Synthesis and biological evaluation of new imidazole, pyrimidine, and purine derivatives and analogs as inhibitors of xanthine oxidase. J Med Chem 39:2529-35 (1996)  
Target
Name:
Xanthine dehydrogenase/oxidase
Synonyms:
XD XDHA XO Xanthine dehydrogenase/oxidase | Xanthine oxidase
Type:
Enzyme
Mol. Mass.:
146441.21
Organism:
Homo sapiens (Human)
Description:
P47989
Residue:
1333
  
Inhibitor
Name:
BDBM50051737
Synonyms:
2-Hexylsulfanyl-1,9-dihydro-purin-6-one | CHEMBL86056
Type:
Small organic molecule
Emp. Form.:
C11H16N4OS
Mol. Mass.:
252.336
SMILES:
CCCCCCSc1nc2nc[nH]c2c(=O)[nH]1
: