Target
Xanthine dehydrogenase/oxidase
Ligand
BDBM50051713
Substrate
Meas. Tech.
ChEMBL_217080 (CHEMBL823476)
Ki
4490±n/a nM
Citation
 Biagi, GCostantini, ACostantino, LGiorgi, ILivi, OPecorari, PRinaldi, MScartoni, V Synthesis and biological evaluation of new imidazole, pyrimidine, and purine derivatives and analogs as inhibitors of xanthine oxidase. J Med Chem 39:2529-35 (1996)  
Target
Name:
Xanthine dehydrogenase/oxidase
Synonyms:
XD XDHA XO Xanthine dehydrogenase/oxidase | Xanthine oxidase
Type:
Enzyme
Mol. Mass.:
146441.21
Organism:
Homo sapiens (Human)
Description:
P47989
Residue:
1333
  
Inhibitor
Name:
BDBM50051713
Synonyms:
2-Benzylsulfanyl-8-hydroxy-1,9-dihydro-purin-6-one | CHEMBL312213
Type:
Small organic molecule
Emp. Form.:
C12H10N4O2S
Mol. Mass.:
274.298
SMILES:
O=c1[nH]c2nc(SCc3ccccc3)[nH]c(=O)c2[nH]1
: