Target
Xanthine dehydrogenase/oxidase
Ligand
BDBM50051726
Substrate
Meas. Tech.
ChEMBL_217080 (CHEMBL823476)
Ki
24390±n/a nM
Citation
 Biagi, GCostantini, ACostantino, LGiorgi, ILivi, OPecorari, PRinaldi, MScartoni, V Synthesis and biological evaluation of new imidazole, pyrimidine, and purine derivatives and analogs as inhibitors of xanthine oxidase. J Med Chem 39:2529-35 (1996)  
Target
Name:
Xanthine dehydrogenase/oxidase
Synonyms:
XD XDHA XO Xanthine dehydrogenase/oxidase | Xanthine oxidase
Type:
Enzyme
Mol. Mass.:
146441.21
Organism:
Homo sapiens (Human)
Description:
P47989
Residue:
1333
  
Inhibitor
Name:
BDBM50051726
Synonyms:
2-Mercapto-6,7-dihydro-3H-thiazolo[3,2-a]purin-9-one | CHEMBL82268
Type:
Small organic molecule
Emp. Form.:
C7H6N4OS2
Mol. Mass.:
226.279
SMILES:
O=c1n2CCSc2nc2[nH]c(=S)[nH]c12
: