Target
Sodium-dependent dopamine transporter
Ligand
BDBM50051758
Substrate
Meas. Tech.
ChEMBL_61828 (CHEMBL879860)
IC50
540±n/a nM
Citation
 Davies, HMKuhn, LAThornley, CMatasi, JJSexton, TChilders, SR Synthesis of 3 beta-aryl-8-azabicyclo[3.2.1]octanes with high binding affinities and selectivities for the serotonin transporter site. J Med Chem 39:2554-8 (1996)  
Target
Name:
Sodium-dependent dopamine transporter
Synonyms:
DA transporter SC6A3_RAT Sodium-dependent dopamine transporter | Sodium-dependent dopamine transporter (DAT)
Type:
Multi-pass membrane protein
Mol. Mass.:
68749.45
Organism:
Rattus norvegicus (rat)
Description:
P23977
Residue:
619
  
Inhibitor
Name:
BDBM50051758
Synonyms:
1-[3-(4-Isopropyl-phenyl)-8-aza-bicyclo[3.2.1]oct-2-yl]-propan-1-one | CHEMBL85256
Type:
Small organic molecule
Emp. Form.:
C19H27NO
Mol. Mass.:
285.4238
SMILES:
CCC(=O)C1C2CCC(CC1c1ccc(cc1)C(C)C)N2
: