Target
Sodium-dependent dopamine transporter
Ligand
BDBM50041293
Substrate
Meas. Tech.
ChEMBL_61828 (CHEMBL879860)
IC50
0.12±n/a nM
Citation
 Davies, HMKuhn, LAThornley, CMatasi, JJSexton, TChilders, SR Synthesis of 3 beta-aryl-8-azabicyclo[3.2.1]octanes with high binding affinities and selectivities for the serotonin transporter site. J Med Chem 39:2554-8 (1996)  
Target
Name:
Sodium-dependent dopamine transporter
Synonyms:
DA transporter SC6A3_RAT Sodium-dependent dopamine transporter | Sodium-dependent dopamine transporter (DAT)
Type:
Multi-pass membrane protein
Mol. Mass.:
68749.45
Organism:
Rattus norvegicus (rat)
Description:
P23977
Residue:
619
  
Inhibitor
Name:
BDBM50041293
Synonyms:
1-(8-Methyl-3-naphthalen-2-yl-8-aza-bicyclo[3.2.1]oct-2-yl)-propan-1-one WF-23
Type:
Small organic molecule
Emp. Form.:
C21H25NO
Mol. Mass.:
307.4293
SMILES:
CCC(=O)C1C2CCC(CC1c1ccc3ccccc3c1)N2C
: