Target
Proto-oncogene tyrosine-protein kinase Src
Ligand
BDBM50052036
Substrate
Meas. Tech.
ChEMBL_202768 (CHEMBL808764)
IC50
>100000±n/a nM
Citation
 Jirousek, MRGillig, JRGonzalez, CMHeath, WFMcDonald, JHNeel, DARito, CJSingh, UStramm, LEMelikian-Badalian, ABaevsky, MBallas, LMHall, SEWinneroski, LLFaul, MM (S)-13-[(dimethylamino)methyl]-10,11,14,15-tetrahydro-4,9:16, 21-dimetheno-1H, 13H-dibenzo[e,k]pyrrolo[3,4-h][1,4,13]oxadiazacyclohexadecene-1,3(2H)-d ione (LY333531) and related analogues: isozyme selective inhibitors of protein kinase C beta. J Med Chem 39:2664-71 (1996)  
Target
Name:
Proto-oncogene tyrosine-protein kinase Src
Synonyms:
Calmodulin/Proto-oncogene tyrosine-protein kinase Src Proto-oncogene c-Src SRC SRC_HUMAN V-src sarcoma (Schmidt-Ruppin A-2) viral oncogene homolog (avian) p60-Src | pp60c-src
Type:
Protein
Mol. Mass.:
59838.60
Organism:
Homo sapiens (Human)
Description:
P12931
Residue:
536
  
Inhibitor
Name:
BDBM50052036
Synonyms:
3,5-dioxo-17-phenylsulfonamidomethyl-(17S)-18-oxa-4,14,21-triazahexacyclo[19.6.1.17,14.02,6.08,13.022,27]nonacosa-1(28),2(6),7(29),8(13),9,11,22(27),23,25-nonaene | CHEMBL315389
Type:
Small organic molecule
Emp. Form.:
C32H28N4O5S
Mol. Mass.:
580.654
SMILES:
O=C1NC(=O)C2=C1c1cn(CCO[C@H](CNS(=O)(=O)c3ccccc3)CCn3cc2c2ccccc32)c2ccccc12
: