Target
D(3) dopamine receptor
Ligand
BDBM50052185
Substrate
Meas. Tech.
ChEMBL_62756 (CHEMBL674596)
Ki
55±n/a nM
Citation
 Ohmori, JMaeno, KHidaka, KNakato, KMatsumoto, MTada, SHattori, HSakamoto, STsukamoto, SUsuda, SMase, T Dopamine D3 and D4 receptor antagonists: synthesis and structure--activity relationships of (S)-(+)-N-(1-Benzyl-3-pyrrolidinyl)-5-chloro-4- [(cyclopropylcarbonyl) amino]-2-methoxybenzamide (YM-43611) and related compounds. J Med Chem 39:2764-72 (1996)  
Target
Name:
D(3) dopamine receptor
Synonyms:
DOPAMINE D3 Dopamine D3 receptor | Drd3
Type:
Protein
Mol. Mass.:
49540.58
Organism:
Rattus norvegicus (Rat)
Description:
P19020
Residue:
446
  
Inhibitor
Name:
BDBM50052185
Synonyms:
CHEMBL92030 | N-((S)-1-Benzyl-pyrrolidin-3-yl)-5-chloro-4-(cyclopentanecarbonyl-amino)-2-methoxy-benzamide
Type:
Small organic molecule
Emp. Form.:
C25H30ClN3O3
Mol. Mass.:
455.977
SMILES:
COc1cc(NC(=O)C2CCCC2)c(Cl)cc1C(=O)N[C@H]1CCN(Cc2ccccc2)C1
: