Target
D(2) dopamine receptor
Ligand
BDBM50052189
Substrate
Meas. Tech.
ChEMBL_62247 (CHEMBL671579)
Ki
630±n/a nM
Citation
 Ohmori, JMaeno, KHidaka, KNakato, KMatsumoto, MTada, SHattori, HSakamoto, STsukamoto, SUsuda, SMase, T Dopamine D3 and D4 receptor antagonists: synthesis and structure--activity relationships of (S)-(+)-N-(1-Benzyl-3-pyrrolidinyl)-5-chloro-4- [(cyclopropylcarbonyl) amino]-2-methoxybenzamide (YM-43611) and related compounds. J Med Chem 39:2764-72 (1996)  
Target
Name:
D(2) dopamine receptor
Synonyms:
DOPAMINE D2 DOPAMINE D2 Short Dopamine D2 receptor Drd2
Type:
G Protein-Coupled Receptor (GPCR)
Mol. Mass.:
50931.60
Organism:
Rattus norvegicus (rat)
Description:
P61169
Residue:
444
  
Inhibitor
Name:
BDBM50052189
Synonyms:
4-Benzoylamino-N-((S)-1-benzyl-pyrrolidin-3-yl)-5-chloro-2-methoxy-benzamide | CHEMBL91693
Type:
Small organic molecule
Emp. Form.:
C26H26ClN3O3
Mol. Mass.:
463.956
SMILES:
COc1cc(NC(=O)c2ccccc2)c(Cl)cc1C(=O)N[C@H]1CCN(Cc2ccccc2)C1
: