Target
D(2) dopamine receptor
Ligand
BDBM50052196
Substrate
Meas. Tech.
ChEMBL_62247 (CHEMBL671579)
Ki
0.81±n/a nM
Citation
 Ohmori, JMaeno, KHidaka, KNakato, KMatsumoto, MTada, SHattori, HSakamoto, STsukamoto, SUsuda, SMase, T Dopamine D3 and D4 receptor antagonists: synthesis and structure--activity relationships of (S)-(+)-N-(1-Benzyl-3-pyrrolidinyl)-5-chloro-4- [(cyclopropylcarbonyl) amino]-2-methoxybenzamide (YM-43611) and related compounds. J Med Chem 39:2764-72 (1996)  
Target
Name:
D(2) dopamine receptor
Synonyms:
DOPAMINE D2 DOPAMINE D2 Short Dopamine D2 receptor Drd2
Type:
G Protein-Coupled Receptor (GPCR)
Mol. Mass.:
50931.60
Organism:
Rattus norvegicus (rat)
Description:
P61169
Residue:
444
  
Inhibitor
Name:
BDBM50052196
Synonyms:
CHEMBL319597 | N-((S)-1-Bicyclo[3.3.1]non-9-yl-pyrrolidin-3-yl)-5-chloro-2-methoxy-4-methylamino-benzamide
Type:
Small organic molecule
Emp. Form.:
C22H32ClN3O2
Mol. Mass.:
405.961
SMILES:
CNc1cc(OC)c(cc1Cl)C(=O)N[C@H]1CCN(C1)C1C2CCCC1CCC2
: