Target
D(4) dopamine receptor
Ligand
BDBM50052191
Substrate
Meas. Tech.
ChEMBL_60660 (CHEMBL671697)
Ki
1.1±n/a nM
Citation
 Ohmori, JMaeno, KHidaka, KNakato, KMatsumoto, MTada, SHattori, HSakamoto, STsukamoto, SUsuda, SMase, T Dopamine D3 and D4 receptor antagonists: synthesis and structure--activity relationships of (S)-(+)-N-(1-Benzyl-3-pyrrolidinyl)-5-chloro-4- [(cyclopropylcarbonyl) amino]-2-methoxybenzamide (YM-43611) and related compounds. J Med Chem 39:2764-72 (1996)  
Target
Name:
D(4) dopamine receptor
Synonyms:
D(2C) dopamine receptor DOPAMINE D4.2 DRD4 Dopamine D4 receptor
Type:
Enzyme
Mol. Mass.:
48373.19
Organism:
Homo sapiens (Human)
Description:
P21917
Residue:
419
  
Inhibitor
Name:
BDBM50052191
Synonyms:
4-Amino-N-((S)-1-benzyl-pyrrolidin-3-yl)-5-chloro-2-methoxy-benzamide | CHEMBL329106
Type:
Small organic molecule
Emp. Form.:
C19H22ClN3O2
Mol. Mass.:
359.85
SMILES:
COc1cc(N)c(Cl)cc1C(=O)N[C@H]1CCN(Cc2ccccc2)C1
: