Target
Calpain-1 catalytic subunit
Ligand
BDBM50053867
Substrate
Meas. Tech.
ChEMBL_43668 (CHEMBL656201)
Ki
350±n/a nM
Citation
 Li, ZOrtega-Vilain, ACPatil, GSChu, DLForeman, JEEveleth, DDPowers, JC Novel peptidyl alpha-keto amide inhibitors of calpains and other cysteine proteases. J Med Chem 39:4089-98 (1996)  
Target
Name:
Calpain-1 catalytic subunit
Synonyms:
CAN1_HUMAN CAPN1 Calpain-1 (u-Calpain) Calpain1
Type:
Protein
Mol. Mass.:
81880.51
Organism:
Homo sapiens (Human)
Description:
Residue:
714
  
Inhibitor
Name:
BDBM50053867
Synonyms:
CHEMBL133749 | [1-(1-Benzyl-2-methylcarbamoyl-2-oxo-ethylcarbamoyl)-3-methyl-butyl]-carbamic acid benzyl ester
Type:
Small organic molecule
Emp. Form.:
C25H31N3O5
Mol. Mass.:
453.5307
SMILES:
CNC(=O)C(=O)C(Cc1ccccc1)NC(=O)C(CC(C)C)NC(=O)OCc1ccccc1
: