Target
Adenosine receptor A3
Ligand
BDBM50053926
Substrate
Meas. Tech.
ChEMBL_31845 (CHEMBL641522)
Ki
21.5±n/a nM
Citation
 Kim, YCJi, XDJacobson, KA Derivatives of the triazoloquinazoline adenosine antagonist (CGS15943) are selective for the human A3 receptor subtype. J Med Chem 39:4142-8 (1996)  
Target
Name:
Adenosine receptor A3
Synonyms:
A3 adenosine receptor (hA3) ADORA3 | Adenosine A3 receptor (A3AR)
Type:
G Protein-Coupled Receptor (GPCR)
Mol. Mass.:
36197.32
Organism:
Homo sapiens (Human)
Description:
P0DMS8
Residue:
318
  
Inhibitor
Name:
BDBM50053926
Synonyms:
CHEMBL313422 | Pentanoic acid (9-chloro-2-furan-2-yl-[1,2,4]triazolo[1,5-c]quinazolin-5-yl)-amide
Type:
Small organic molecule
Emp. Form.:
C18H16ClN5O2
Mol. Mass.:
369.805
SMILES:
CCCCC(=O)Nc1nc2ccc(Cl)cc2c2nc(nn12)-c1ccco1
: