Target
5-hydroxytryptamine receptor 1A
Ligand
BDBM50054142
Substrate
Meas. Tech.
ChEMBL_839 (CHEMBL615839)
IC50
68.0±n/a nM
Citation
 Comoy, CMarot, CPodona, TBaudin, MLMorin-Allory, LGuillaumet, GPfeiffer, BCaignard, DHRenard, PRettori, MCAdam, GGuardiola-Lemaitre, B 3-amino-3,4-dihydro-2H-1-benzopyran derivatives as 5-HT1A receptor ligands and potential anxiolytic agents. 2. Synthesis and quantitative structure-activity relationship studies of spiro[pyrrolidine- and piperidine-2,3'(2'H)-benzopyrans] J Med Chem 39:4285-98 (1996)  
Target
Name:
5-hydroxytryptamine receptor 1A
Synonyms:
5-HT-1A 5-HT1A 5-hydroxytryptamine receptor 1A (5HT1A) 5ht1a Htr1a Serotonin 1a (5-HT1a) receptor/Adrenergic receptor alpha-1 | Serotonin receptor 1A
Type:
G Protein-Coupled Receptor (GPCR)
Mol. Mass.:
46445.29
Organism:
Rattus norvegicus (rat)
Description:
Binding assays were performed using rat hippocampal membranes.
Residue:
422
  
Inhibitor
Name:
BDBM50054142
Synonyms:
5-methoxy-1'-[4-(4-methylphenylsulfonamido)butyl]spiro[3,4-dihydro-2H-chromene-3,2'-(hexahydropyridine)] | CHEMBL137486
Type:
Small organic molecule
Emp. Form.:
C25H34N2O4S
Mol. Mass.:
458.613
SMILES:
COc1cccc2OCC3(CCCCN3CCCCNS(=O)(=O)c3ccc(C)cc3)Cc12
: