Target
Gag-Pol polyprotein [489-587]
Ligand
BDBM50054173
Substrate
Meas. Tech.
ChEMBL_160750 (CHEMBL769064)
Ki
0.260000±n/a nM
Citation
 Wilkerson, WWAkamike, ECheatham, WWHollis, AYCollins, RDDeLucca, ILam, PYRu, Y HIV protease inhibitory bis-benzamide cyclic ureas: a quantitative structure-activity relationship analysis. J Med Chem 39:4299-312 (1996)  
Target
Name:
Gag-Pol polyprotein [489-587]
Synonyms:
Human immunodeficiency virus type 1 protease Pol polyprotein | gag-pol
Type:
Enzyme Subunit
Mol. Mass.:
10781.16
Organism:
Human immunodeficiency virus type 1
Description:
P04585[489-587]
Residue:
99
  
Inhibitor
Name:
BDBM50054173
Synonyms:
2-{3-[4,7-dibenzyl-5,6-dihydroxy-3-[3-(3-methyl-2-pyridylcarbamoyl)benzyl]-2-oxo-(4R,5S,6S,7R)-1,3-diazepan-1-ylmethyl]phenylcarboxamido}-3-methylpyridine | CHEMBL85585
Type:
Small organic molecule
Emp. Form.:
C47H46N6O5
Mol. Mass.:
774.9053
SMILES:
Cc1cccnc1NC(=O)c1cccc(CN2[C@H](Cc3ccccc3)[C@H](O)[C@@H](O)[C@@H](Cc3ccccc3)N(Cc3cccc(c3)C(=O)Nc3ncccc3C)C2=O)c1
: