Target
Gag-Pol polyprotein [489-587]
Ligand
BDBM50054162
Substrate
Meas. Tech.
ChEMBL_160750 (CHEMBL769064)
Ki
0.245000±n/a nM
Citation
 Wilkerson, WWAkamike, ECheatham, WWHollis, AYCollins, RDDeLucca, ILam, PYRu, Y HIV protease inhibitory bis-benzamide cyclic ureas: a quantitative structure-activity relationship analysis. J Med Chem 39:4299-312 (1996)  
Target
Name:
Gag-Pol polyprotein [489-587]
Synonyms:
Human immunodeficiency virus type 1 protease Pol polyprotein | gag-pol
Type:
Enzyme Subunit
Mol. Mass.:
10781.16
Organism:
Human immunodeficiency virus type 1
Description:
P04585[489-587]
Residue:
99
  
Inhibitor
Name:
BDBM50054162
Synonyms:
3,5-dichloro-2-{3-[4,7-dibenzyl-3-[3-(3,5-dichloro-2-pyridylcarbamoyl)benzyl]-5,6-dihydroxy-2-oxo-(4R,5S,6S,7R)-1,3-diazepan-1-ylmethyl]phenylcarboxamido}pyridine | CHEMBL421730
Type:
Small organic molecule
Emp. Form.:
C45H38Cl4N6O5
Mol. Mass.:
884.632
SMILES:
O[C@@H]1[C@@H](O)[C@@H](Cc2ccccc2)N(Cc2cccc(c2)C(=O)Nc2ncc(Cl)cc2Cl)C(=O)N(Cc2cccc(c2)C(=O)Nc2ncc(Cl)cc2Cl)[C@@H]1Cc1ccccc1
: