Target
Anionic trypsin
Ligand
BDBM50054482
Substrate
Meas. Tech.
ChEMBL_212174 (CHEMBL815149)
IC50
1.2±n/a nM
Citation
 Levy, OESemple, JELim, MLReiner, JRote, WEDempsey, ERichard, BMZhang, ETulinsky, ARipka, WCNutt, RF Potent and selective thrombin inhibitors incorporating the constrained arginine mimic l-3-piperidyl(N-guanidino)alanine at P1. J Med Chem 39:4527-30 (1996)  
Target
Name:
Anionic trypsin
Synonyms:
Anionic trypsin Trypsin II
Type:
PROTEIN
Mol. Mass.:
26281.39
Organism:
Bos taurus
Description:
ChEMBL_212177
Residue:
247
  
Inhibitor
Name:
BDBM50054482
Synonyms:
(S)-4-[(S)-2-((S)-1-Formyl-4-guanidino-butylcarbamoyl)-pyrrolidin-1-yl]-4-oxo-3-(2-propyl-pentanoylamino)-butyric acid methyl ester | CHEMBL141676
Type:
Small organic molecule
Emp. Form.:
C24H42N6O6
Mol. Mass.:
510.6269
SMILES:
CCCC(CCC)C(=O)N[C@@H](CC(=O)OC)C(=O)N1CCC[C@H]1C(=O)N[C@@H](CCCNC(N)=N)C=O
: