Target
Gag-Pol polyprotein [489-587]
Ligand
BDBM50054612
Substrate
Meas. Tech.
ChEMBL_159327 (CHEMBL769380)
IC50
>10000±n/a nM
Citation
 Thaisrivongs, SRomero, DLTommasi, RAJanakiraman, MNStrohbach, JWTurner, SRBiles, CMorge, RRJohnson, PDAristoff, PATomich, PKLynn, JCHorng, MMChong, KTHinshaw, RRHowe, WJFinzel, BCWatenpaugh, KD Structure-based design of HIV protease inhibitors: 5,6-dihydro-4-hydroxy-2-pyrones as effective, nonpeptidic inhibitors. J Med Chem 39:4630-42 (1996)  
Target
Name:
Gag-Pol polyprotein [489-587]
Synonyms:
Human immunodeficiency virus type 1 protease Pol polyprotein | gag-pol
Type:
Enzyme Subunit
Mol. Mass.:
10781.16
Organism:
Human immunodeficiency virus type 1
Description:
P04585[489-587]
Residue:
99
  
Inhibitor
Name:
BDBM50054612
Synonyms:
4-Hydroxy-3-(1-phenyl-allyl)-1,9-dioxa-spiro[5.5]undec-3-en-2-one | CHEMBL337360
Type:
Small organic molecule
Emp. Form.:
C18H20O4
Mol. Mass.:
300.349
SMILES:
C=CC(C1C(=O)CC2(CCOCC2)OC1=O)c1ccccc1
: