Target
5-hydroxytryptamine receptor 1D
Ligand
BDBM50054760
Substrate
Meas. Tech.
ChEMBL_2001 (CHEMBL617094)
Ki
36±n/a nM
Citation
 Barf, TAde Boer, PWikström, HPeroutka, SJSwensson, KEnnis, MDGhazal, NBMcGuire, JCSmith, MW 5-HT1D receptor agonist properties of novel 2-[5-[[(trifluoromethyl)sulfonyl]oxy]indolyl]ethylamines and their use as synthetic intermediates. J Med Chem 39:4717-26 (1997)  
Target
Name:
5-hydroxytryptamine receptor 1D
Synonyms:
5-HT-1D 5-HT1D 5HT1D_HUMAN HTR1DA Serotonin (5-HT) receptor | Serotonin Receptor 1D
Type:
G Protein-Coupled Receptor (GPCR)
Mol. Mass.:
41920.63
Organism:
Homo sapiens (Human)
Description:
Receptor binding assays were performed using human clone stably expressed in CHO cells.
Residue:
377
  
Inhibitor
Name:
BDBM50054760
Synonyms:
CHEMBL143967 | Trifluoro-methanesulfonic acid 3-(2-dipropylamino-ethyl)-1H-indol-5-yl ester
Type:
Small organic molecule
Emp. Form.:
C17H23F3N2O3S
Mol. Mass.:
392.436
SMILES:
CCCN(CCC)CCc1c[nH]c2ccc(OS(=O)(=O)C(F)(F)F)cc12
: