Target
5-hydroxytryptamine receptor 1A
Ligand
BDBM50054757
Substrate
Meas. Tech.
ChEMBL_935 (CHEMBL616300)
Ki
27±n/a nM
Citation
 Barf, TAde Boer, PWikström, HPeroutka, SJSwensson, KEnnis, MDGhazal, NBMcGuire, JCSmith, MW 5-HT1D receptor agonist properties of novel 2-[5-[[(trifluoromethyl)sulfonyl]oxy]indolyl]ethylamines and their use as synthetic intermediates. J Med Chem 39:4717-26 (1997)  
Target
Name:
5-hydroxytryptamine receptor 1A
Synonyms:
5-HT-1A 5-hydroxytryptamine receptor 1A (5-HT-1A) ADRB2RL1 Dopamine D2 receptor and serotonin 1a receptor HTR1A | Serotonin receptor 1A
Type:
Mol. Mass.:
46122.49
Organism:
Homo sapiens (Human)
Description:
Residue:
422
  
Inhibitor
Name:
BDBM50054757
Synonyms:
CHEMBL143510 | Trifluoro-methanesulfonic acid 3-(2-diethylamino-ethyl)-1H-indol-5-yl ester
Type:
Small organic molecule
Emp. Form.:
C15H19F3N2O3S
Mol. Mass.:
364.383
SMILES:
CCN(CC)CCc1c[nH]c2ccc(OS(=O)(=O)C(F)(F)F)cc12
: