Target
Gastrin/cholecystokinin type B receptor
Ligand
BDBM50056089
Substrate
Meas. Tech.
ChEMBL_48592 (CHEMBL662472)
IC50
0.17±n/a nM
Citation
 Semple, GRyder, HRooker, DPBatt, ARKendrick, DASzelke, MOhta, MSatoh, MNishida, AAkuzawa, SMiyata, K (3R)-N-(1-(tert-butylcarbonylmethyl)-2,3-dihydro-2-oxo-5-(2-pyridyl)-1H-1,4-benzodiazepin-3-yl)-N'-(3-(methylamino)phenyl)urea (YF476): a potent and orally active gastrin/CCK-B antagonist. J Med Chem 40:331-41 (1997)  
Target
Name:
Gastrin/cholecystokinin type B receptor
Synonyms:
Cckbr Cholecystokinin B receptor GASR_RAT | Gastrin/cholecystokinin type B receptor
Type:
Enzyme Catalytic Domain
Mol. Mass.:
48980.43
Organism:
RAT
Description:
Cholecystokinin A CCKBR RAT::P30553
Residue:
452
  
Inhibitor
Name:
BDBM50056089
Synonyms:
1-[(R)-1-(3,3-Dimethyl-2-oxo-butyl)-2-oxo-5-phenyl-2,3-dihydro-1H-benzo[e][1,4]diazepin-3-yl]-3-(3-pyrrolidin-1-yl-phenyl)-urea | CHEMBL330933
Type:
Small organic molecule
Emp. Form.:
C32H35N5O3
Mol. Mass.:
537.652
SMILES:
CC(C)(C)C(=O)CN1c2ccccc2C(=N[C@@H](NC(=O)Nc2cccc(c2)N2CCCC2)C1=O)c1ccccc1
: