Target
Cholinesterase
Ligand
BDBM10404
Substrate
Meas. Tech.
ChEMBL_1821777 (CHEMBL4321437)
IC50
13180±n/a nM
Citation
 Tu, YWu, CKang, YLi, QZhu, CLi, Y Bioactivity-guided identification of flavonoids with cholinesterase and ?-amyloid peptide aggregation inhibitory effects from the seeds of Millettia pachycarpa. Bioorg Med Chem Lett 29:1194-1198 (2019)  
Target
Name:
Cholinesterase
Synonyms:
Acylcholine acylhydrolase Butyrylcholine esterase (BChE) Butyrylcholinesterase (BuChE) CHLE_HUMAN Cholinesterases Pseudocholinesterase
Type:
Homotetramer
Mol. Mass.:
68422.27
Organism:
Homo sapiens (Human)
Description:
P06276
Residue:
602
  
Inhibitor
Name:
BDBM10404
Synonyms:
(1S,12S,14R)-9-methoxy-4-methyl-11-oxa-4-azatetracyclo[8.6.1.0^{1,12}.0^{6,17}]heptadeca-6,8,10(17),15-tetraen-14-ol GALANTAMINE HYDROBROMIDE Galanthamine Lycoremine Nivaline Reminyl US9586925, Galantamine | galantamine
Type:
Small organic molecule
Emp. Form.:
C17H21NO3
Mol. Mass.:
287.3535
SMILES:
COc1ccc2CN(C)CC[C@@]34C=C[C@H](O)C[C@@H]3Oc1c24
: