Target
Fucose-binding lectin PA-IIL
Ligand
BDBM50505596
Substrate
Meas. Tech.
ChEMBL_1823412 (CHEMBL4323176)
IC50
1750±n/a nM
Citation
 Sommer, RRox, KWagner, SHauck, DHenrikus, SSNewsad, SArnold, TRyckmans, TBrönstrup, MImberty, AVarrot, AHartmann, RWTitz, A Anti-biofilm Agents against  J Med Chem 62:9201-9216 (2019)  
Target
Name:
Fucose-binding lectin PA-IIL
Synonyms:
LecB | PA-IIL
Type:
Protein
Mol. Mass.:
11857.84
Organism:
Pseudomonas aeruginosa
Description:
Q9HYN5
Residue:
115
  
Inhibitor
Name:
BDBM50505596
Synonyms:
CHEMBL4439075
Type:
Small organic molecule
Emp. Form.:
C20H23NO7S2
Mol. Mass.:
453.529
SMILES:
COc1ccc(cc1)C#Cc1ccc(s1)S(=O)(=O)NC[C@H]1O[C@@H](C)[C@@H](O)[C@@H](O)[C@@H]1O
: