Target
Mu-type opioid receptor
Ligand
BDBM50506207
Substrate
Meas. Tech.
ChEMBL_1825162 (CHEMBL4324926)
EC50
0.470000±n/a nM
Citation
 Ma, HObeng, SWang, HZheng, YLi, MJali, AMStevens, DLDewey, WLSelley, DEZhang, Y Application of Bivalent Bioisostere Concept on Design and Discovery of Potent Opioid Receptor Modulators. J Med Chem 62:11399-11415 (2019)  
Target
Name:
Mu-type opioid receptor
Synonyms:
M-OR-1 Mor OPRM_MOUSE Oprm | Oprm1
Type:
Enzyme Catalytic Domain
Mol. Mass.:
44431.62
Organism:
MOUSE
Description:
OPIATE Mu OPRM1 MOUSE::P42866
Residue:
398
  
Inhibitor
Name:
BDBM50506207
Synonyms:
CHEMBL4466064
Type:
Small organic molecule
Emp. Form.:
C29H31ClN2O5
Mol. Mass.:
523.02
SMILES:
Cl.[H][C@@]12Oc3c4c(C[C@@]5([H])N(CC6CC6)CC[C@@]14[C@@]5(O)CC[C@H]2NC(=O)c1coc2ccccc12)ccc3O
: