Target
5-hydroxytryptamine receptor 4
Ligand
BDBM29526
Substrate
Meas. Tech.
ChEMBL_3347 (CHEMBL619047)
Ki
1.07±n/a nM
Citation
 Soulier, JLYang, DBrémont, BCroci, TGuzzi, ULanglois, M Arylcarbamate derivatives of 1-piperidineethanol as potent ligands for 5-HT4 receptors. J Med Chem 40:1755-61 (1997)  
Target
Name:
5-hydroxytryptamine receptor 4
Synonyms:
5-HT-4 5-HT4L 5-hydroxytryptamine receptor 4 Htr4 Serotonin 4 (5-HT4) receptor
Type:
Enzyme Catalytic Domain
Mol. Mass.:
46117.31
Organism:
RAT
Description:
5-HT4 HTR4 RAT::Q62758
Residue:
406
  
Inhibitor
Name:
BDBM29526
Synonyms:
2-Piperidinoethyl 4-amino-5-chloro-2-methoxybenzoate ML 10302 | ML10302
Type:
Small organic molecule
Emp. Form.:
C15H21ClN2O3
Mol. Mass.:
312.792
SMILES:
COc1cc(N)c(Cl)cc1C(=O)OCCN1CCCCC1
: