Target
Endothelial lipase
Ligand
BDBM50506498
Substrate
Meas. Tech.
ChEMBL_1826010 (CHEMBL4325774)
IC50
200±n/a nM
Citation
 Tora, GKim, SHPi, ZJohnson, JAJiang, JPhillips, MLloyd, JAbell, LMLu, HLocke, GAdam, LPTaylor, DSYin, XBehnia, KZhao, LYang, RBasso, MCaporuscio, CChen, AYLiu, EKirshgessner, TOnorato, JMRyan, CTraeger, SCGordon, DWexler, RRFinlay, HJ Identification of Reversible Small Molecule Inhibitors of Endothelial Lipase (EL) That Demonstrate HDL-C Increase In Vivo. J Med Chem 63:1660-1670 (2020)  
Target
Name:
Endothelial lipase
Synonyms:
EDL Endothelial lipase LIPE_MOUSE | Lipg
Type:
Protein
Mol. Mass.:
56643.58
Organism:
Mus musculus (Mouse)
Description:
Q9WVG5
Residue:
500
  
Inhibitor
Name:
BDBM50506498
Synonyms:
CHEMBL4581886
Type:
Small organic molecule
Emp. Form.:
C19H13FN6O5S2
Mol. Mass.:
488.472
SMILES:
NS(=O)(=O)NCc1nnc(o1)C(=O)c1nc2cc(c(F)cc2s1)-c1ccc2C(=O)NCc2c1
: