Target
Fucose-binding lectin PA-IIL
Ligand
BDBM50505613
Substrate
Meas. Tech.
ChEMBL_1827064 (CHEMBL4326938)
IC50
1800±n/a nM
Citation
 Parrino, BSchillaci, DCarnevale, IGiovannetti, EDiana, PCirrincione, GCascioferro, S Synthetic small molecules as anti-biofilm agents in the struggle against antibiotic resistance. Eur J Med Chem 161:154-178 (2019)  
Target
Name:
Fucose-binding lectin PA-IIL
Synonyms:
LecB | PA-IIL
Type:
Protein
Mol. Mass.:
11857.84
Organism:
Pseudomonas aeruginosa
Description:
Q9HYN5
Residue:
115
  
Inhibitor
Name:
BDBM50505613
Synonyms:
CHEMBL4441817
Type:
Small organic molecule
Emp. Form.:
C11H17NO6S2
Mol. Mass.:
323.386
SMILES:
C[C@@H]1O[C@H](CNS(=O)(=O)c2cccs2)[C@@H](O)[C@H](O)[C@@H]1O
: