Target
D(4) dopamine receptor
Ligand
BDBM50050471
Substrate
Meas. Tech.
ChEMBL_60829 (CHEMBL675818)
Ki
2.5±n/a nM
Citation
 Rowley, MCollins, IBroughton, HBDavey, WBBaker, REmms, FMarwood, RPatel, SPatel, SRagan, CIFreedman, SBBall, RLeeson, PD 4-Heterocyclylpiperidines as selective high-affinity ligands at the human dopamine D4 receptor. J Med Chem 40:2374-85 (1997)  
Target
Name:
D(4) dopamine receptor
Synonyms:
D(2C) dopamine receptor DOPAMINE D4.2 DRD4 Dopamine D4 receptor
Type:
Enzyme
Mol. Mass.:
48373.19
Organism:
Homo sapiens (Human)
Description:
P21917
Residue:
419
  
Inhibitor
Name:
BDBM50050471
Synonyms:
4-[3-(4-Chloro-phenyl)-4-methyl-isoxazol-5-yl]-1-phenethyl-piperidine | CHEMBL293341
Type:
Small organic molecule
Emp. Form.:
C23H25ClN2O
Mol. Mass.:
380.91
SMILES:
Cc1c(onc1-c1ccc(Cl)cc1)C1CCN(CCc2ccccc2)CC1
: